refill code in system.py

27 jobs for master in 41 minutes (queued for 8 seconds)
Status Job ID Name Coverage
  Build Env
manual #147495
allowed to fail manual
build-env:conda
manual #147493
allowed to fail manual
build-env:debian
manual #147497
allowed to fail manual
build-env:default
manual #147491
allowed to fail manual
build-env:ubuntu
 
  Build
passed #147509
build:bleeding-edge

00:10:22

passed #147502
build:debian

00:04:25

passed #147507
build:latest

00:04:24

passed #147505
build:no-extras

00:04:05

passed #147504
build:stable

00:04:23

passed #147500
build:ubuntu

00:04:48

 
  Test
failed #147531
build PDF documentation

00:01:31

failed #147529
build documentation

00:01:31

failed #147533
allowed to fail
check for broken links in doc

00:06:27

passed #147513
check for dependencies installed

00:01:29

passed #147511
check whitespace style

00:01:32

failed #147527
coverage:latest

00:30:33

failed #147525
allowed to fail
test:bleeding-edge

00:09:01

failed #147521
test:debian

00:02:27

failed #147523
test:latest

00:02:29

failed #147516
test:no-extras

00:01:56

failed #147515
test:stable

00:02:25

failed #147519
test:ubuntu

00:01:49

 
  Deploy
skipped #147537
allowed to fail manual
remove_coverage
skipped #147541
allowed to fail manual
remove_docs
skipped #147535
upload coverage
skipped #147543
upload dev version docs
skipped #147538
upload documentation to the test server
 
Name Stage Failure
failed
coverage:latest Test
22.10s call     kwant/physics/tests/test_gauge.py::test_phases[cubic-finite-2]
========== 1 failed, 542 passed, 6038 warnings in 1811.78s (0:30:11) ===========
/usr/local/envs/kwant-latest/lib/python3.8/site-packages/pep8.py:110: FutureWarning: Possible nested set at position 1
EXTRANEOUS_WHITESPACE_REGEX = re.compile(r'[[({] | []}),;:]')
Authenticating with credentials from /root/.docker/config.json
Uploading artifacts...
tests.xml: found 1 matching files

Uploading artifacts to coordinator... ok
id=147527 responseStatus=201 Created token=N51fqkyq
ERROR: Job failed: exit code 1
failed
test:bleeding-edge Test
/usr/local/envs/kwant-latest/lib/python3.8/site-packages/pep8.py:110: FutureWarning: Possible nested set at position 1
EXTRANEOUS_WHITESPACE_REGEX = re.compile(r'[[({] | []}),;:]')
Running after_script
Uploading artifacts for failed job
Authenticating with credentials from /root/.docker/config.json
Uploading artifacts...
tests.xml: found 1 matching files

Uploading artifacts to coordinator... ok
id=147525 responseStatus=201 Created token=69TLnykt
ERROR: Job failed: exit code 1
failed
check for broken links in doc Test

build finished with problems, 32 warnings.
make: *** [linkcheck] Error 1
Makefile:39: recipe for target 'linkcheck' failed
make: Leaving directory '/builds/kwant/kwant/doc'
Running after_script
Uploading artifacts for failed job
Authenticating with credentials from /root/.docker/config.json
ERROR: Job failed: exit code 1
failed
test:latest Test
2.14s call     kwant/tests/test_qsymm.py::test_inverse_transform
=========== 1 failed, 542 passed, 6038 warnings in 128.28s (0:02:08) ===========
/usr/local/envs/kwant-latest/lib/python3.8/site-packages/pep8.py:110: FutureWarning: Possible nested set at position 1
EXTRANEOUS_WHITESPACE_REGEX = re.compile(r'[[({] | []}),;:]')
Authenticating with credentials from /root/.docker/config.json
Uploading artifacts...
tests.xml: found 1 matching files

Uploading artifacts to coordinator... ok
id=147523 responseStatus=201 Created token=TGWLGLpG
ERROR: Job failed: exit code 1
failed
test:debian Test
1.52s call     kwant/tests/test_rmt.py::test_gaussian_distributions
============ 1 failed, 542 passed, 16 warnings in 72.72s (0:01:12) =============
Running after_script
Uploading artifacts for failed job
Authenticating with credentials from /root/.docker/config.json
Uploading artifacts...
tests.xml: found 1 matching files

Uploading artifacts to coordinator... ok
id=147521 responseStatus=201 Created token=qPqbWqLC
ERROR: Job failed: exit code 1
failed
test:stable Test
2.59s call     kwant/tests/test_plotter.py::test_current
2.07s call kwant/tests/test_qsymm.py::test_basis_ordering
2.01s call kwant/tests/test_plotter.py::test_current_interpolation
============ 1 failed, 542 passed, 14 warnings in 125.34s (0:02:05) ============
Authenticating with credentials from /root/.docker/config.json
Uploading artifacts...
tests.xml: found 1 matching files

Uploading artifacts to coordinator... ok
id=147515 responseStatus=201 Created token=tdzh2kTE
ERROR: Job failed: exit code 1
failed
test:no-extras Test
1.36s call     kwant/tests/test_wraparound.py::test_value_types
=========== 1 failed, 309 passed, 104 skipped, 4 warnings in 42.37s ============
Running after_script
Uploading artifacts for failed job
Authenticating with credentials from /root/.docker/config.json
Uploading artifacts...
tests.xml: found 1 matching files

Uploading artifacts to coordinator... ok
id=147516 responseStatus=201 Created token=YLn8_M3A
ERROR: Job failed: exit code 1
failed
test:ubuntu Test
1.69s call     kwant/physics/tests/test_gauge.py::test_minimal_cycle_basis[2-honeycomb-half-ring]
=========== 1 failed, 542 passed, 1354 warnings in 88.44s (0:01:28) ============
/usr/local/lib/python3.8/dist-packages/pep8.py:110: FutureWarning: Possible nested set at position 1
EXTRANEOUS_WHITESPACE_REGEX = re.compile(r'[[({] | []}),;:]')
Authenticating with credentials from /root/.docker/config.json
Uploading artifacts...
tests.xml: found 1 matching files

Uploading artifacts to coordinator... ok
id=147519 responseStatus=201 Created token=r7d-zCWs
ERROR: Job failed: exit code 1
failed
build PDF documentation Test
Warning, treated as error:
`jupyter-sphinx` was initialized with the `jupyter_sphinx.execute` sub-module. Replace this with `jupyter_sphinx`. Initializing with `jupyter_sphinx.execute` will be removed in version 0.3
Makefile:33: recipe for target 'latex' failed
make: Leaving directory '/builds/kwant/kwant/doc'
make: *** [latex] Error 2
Running after_script
Uploading artifacts for failed job
Authenticating with credentials from /root/.docker/config.json
ERROR: Job failed: exit code 1
failed
build documentation Test
Warning, treated as error:
`jupyter-sphinx` was initialized with the `jupyter_sphinx.execute` sub-module. Replace this with `jupyter_sphinx`. Initializing with `jupyter_sphinx.execute` will be removed in version 0.3
Makefile:39: recipe for target 'html' failed
make: Leaving directory '/builds/kwant/kwant/doc'
make: *** [html] Error 2
Running after_script
Uploading artifacts for failed job
Authenticating with credentials from /root/.docker/config.json
ERROR: Job failed: exit code 1