refill code in system.py

27 jobs for master in 36 minutes and 59 seconds (queued for 5 seconds)
Status Job ID Name Coverage
  Build Env
manual #149010
allowed to fail manual
build-env:conda
manual #149007
allowed to fail manual
build-env:debian
manual #149012
allowed to fail manual
build-env:default
manual #149005
allowed to fail manual
build-env:ubuntu
 
  Build
passed #149023
build:bleeding-edge

00:05:35

passed #149015
build:debian

00:04:19

passed #149021
build:latest

00:04:21

passed #149019
build:no-extras

00:02:33

passed #149017
build:stable

00:02:38

passed #149014
build:ubuntu

00:04:59

 
  Test
failed #149044
build PDF documentation

00:00:41

failed #149042
build documentation

00:01:14

failed #149046
allowed to fail
check for broken links in doc

00:06:34

passed #149027
check for dependencies installed

00:00:40

passed #149025
check whitespace style

00:00:42

failed #149041
coverage:latest

00:31:20

failed #149039
allowed to fail
test:bleeding-edge

00:05:09

failed #149035
test:debian

00:01:46

failed #149037
test:latest

00:02:52

failed #149031
test:no-extras

00:01:13

failed #149029
test:stable

00:02:55

failed #149033
test:ubuntu

00:02:39

 
  Deploy
skipped #149050
allowed to fail manual
remove_coverage
skipped #149052
allowed to fail manual
remove_docs
skipped #149048
upload coverage
skipped #149053
upload dev version docs
skipped #149051
upload documentation to the test server
 
Name Stage Failure
failed
coverage:latest Test
18.22s call     kwant/physics/tests/test_gauge.py::test_phases[cubic-finite-2]
========== 1 failed, 542 passed, 6038 warnings in 1803.96s (0:30:03) ===========
Running after_script
Uploading artifacts for failed job
Authenticating with credentials from /root/.docker/config.json
Uploading artifacts...
tests.xml: found 1 matching files

Uploading artifacts to coordinator... ok
id=149041 responseStatus=201 Created token=oXSjFmWu
ERROR: Job failed: exit code 1
failed
check for broken links in doc Test

build finished with problems, 32 warnings.
make: *** [linkcheck] Error 1
Makefile:39: recipe for target 'linkcheck' failed
make: Leaving directory '/builds/kwant/kwant/doc'
Running after_script
Uploading artifacts for failed job
Authenticating with credentials from /root/.docker/config.json
ERROR: Job failed: exit code 1
failed
test:bleeding-edge Test
2.03s call     kwant/tests/test_qsymm.py::test_inverse_transform
1.79s call kwant/tests/test_plotter.py::test_spectrum[matplotlib]
1.68s call kwant/physics/tests/test_leads.py::test_modes_symmetries
=========== 1 failed, 542 passed, 6037 warnings in 88.04s (0:01:28) ============
Authenticating with credentials from /root/.docker/config.json
Uploading artifacts...
tests.xml: found 1 matching files

Uploading artifacts to coordinator... ok
id=149039 responseStatus=201 Created token=HsRgrYNo
ERROR: Job failed: exit code 1
failed
test:stable Test
1.69s call     kwant/tests/test_qsymm.py::test_inverse_transform
============ 1 failed, 542 passed, 14 warnings in 101.50s (0:01:41) ============
Running after_script
Uploading artifacts for failed job
Authenticating with credentials from /root/.docker/config.json
Uploading artifacts...
tests.xml: found 1 matching files

Uploading artifacts to coordinator... ok
id=149029 responseStatus=201 Created token=and68A5H
ERROR: Job failed: exit code 1
failed
test:latest Test
2.09s call     kwant/tests/test_plotter.py::test_spectrum[matplotlib]
=========== 1 failed, 542 passed, 6038 warnings in 107.13s (0:01:47) ===========
Running after_script
Uploading artifacts for failed job
Authenticating with credentials from /root/.docker/config.json
Uploading artifacts...
tests.xml: found 1 matching files

Uploading artifacts to coordinator... ok
id=149037 responseStatus=201 Created token=zVmNgqQ_
ERROR: Job failed: exit code 1
failed
test:ubuntu Test
1.68s call     kwant/tests/test_wraparound.py::test_plot_2d_bands
=========== 1 failed, 542 passed, 1354 warnings in 85.93s (0:01:25) ============
Running after_script
Uploading artifacts for failed job
Authenticating with credentials from /root/.docker/config.json
Uploading artifacts...
tests.xml: found 1 matching files

Uploading artifacts to coordinator... ok
id=149033 responseStatus=201 Created token=sX_a98sE
ERROR: Job failed: exit code 1
failed
test:debian Test
1.36s call     kwant/tests/test_rmt.py::test_gaussian_distributions
============ 1 failed, 542 passed, 16 warnings in 70.65s (0:01:10) =============
/usr/local/lib/python3.7/dist-packages/pep8.py:110: FutureWarning: Possible nested set at position 1
EXTRANEOUS_WHITESPACE_REGEX = re.compile(r'[[({] | []}),;:]')
Authenticating with credentials from /root/.docker/config.json
Uploading artifacts...
tests.xml: found 1 matching files

Uploading artifacts to coordinator... ok
id=149035 responseStatus=201 Created token=-SDK2bTc
ERROR: Job failed: exit code 1
failed
build documentation Test
Warning, treated as error:
`jupyter-sphinx` was initialized with the `jupyter_sphinx.execute` sub-module. Replace this with `jupyter_sphinx`. Initializing with `jupyter_sphinx.execute` will be removed in version 0.3
Makefile:39: recipe for target 'html' failed
make: Leaving directory '/builds/kwant/kwant/doc'
make: *** [html] Error 2
Running after_script
Uploading artifacts for failed job
Authenticating with credentials from /root/.docker/config.json
ERROR: Job failed: exit code 1
failed
test:no-extras Test
1.08s call     kwant/tests/test_wraparound.py::test_value_types
1.00s call kwant/physics/tests/test_leads.py::test_PHS_TRIM
0.89s call kwant/tests/test_kpm.py::test_convergence_custom_vector_factory
=========== 1 failed, 309 passed, 104 skipped, 4 warnings in 49.06s ============
Authenticating with credentials from /root/.docker/config.json
Uploading artifacts...
tests.xml: found 1 matching files

Uploading artifacts to coordinator... ok
id=149031 responseStatus=201 Created token=1jQqigT6
ERROR: Job failed: exit code 1
failed
build PDF documentation Test
Running Sphinx v3.2.1

Warning, treated as error:
`jupyter-sphinx` was initialized with the `jupyter_sphinx.execute` sub-module. Replace this with `jupyter_sphinx`. Initializing with `jupyter_sphinx.execute` will be removed in version 0.3
make: *** [latex] Error 2
Makefile:33: recipe for target 'latex' failed
make: Leaving directory '/builds/kwant/kwant/doc'
Authenticating with credentials from /root/.docker/config.json
ERROR: Job failed: exit code 1