CI: unpin Kaniko version

40 jobs for enh/unpin_kaniko in 35 minutes and 55 seconds (queued for 4 seconds)
Status Name Job ID Coverage
  Build Env
passed build-env:conda #210855
manual

00:26:41

passed build-env:debian #210854
manual

00:03:31

passed build-env:default #210856
manual

00:25:55

passed build-env:ubuntu #210853
manual

00:03:31

 
  Build
passed build:debian #210895

00:03:09

passed build:latest #210898

00:06:25

passed build:no-extras #210897

00:06:54

passed build:stable #210896

00:06:55

passed build:ubuntu #210894

00:03:27

canceled build:debian #210858

00:00:01

canceled build:latest #210861

00:00:00

canceled build:no-extras #210860

00:00:00

canceled build:stable #210859

00:00:00

canceled build:ubuntu #210857

00:00:01

 
  Test
failed build PDF documentation #210907

00:00:48

failed build documentation #210906

00:00:47

failed check for broken links in doc #210908
allowed to fail

00:00:37

passed check for dependencies installed #210900

00:00:36

passed check whitespace style #210899

00:00:39

passed test:debian #210904

00:01:49

failed test:latest #210905

00:02:14

passed test:no-extras #210902

00:01:12

passed test:stable #210901

00:02:15

passed test:ubuntu #210903

00:01:59

canceled build PDF documentation #210870

canceled build documentation #210869

canceled check for broken links in doc #210871
allowed to fail

canceled check for dependencies installed #210863
allowed to fail

canceled check whitespace style #210862
allowed to fail

canceled test:debian #210867

canceled test:latest #210868

canceled test:no-extras #210865

canceled test:stable #210864

canceled test:ubuntu #210866

 
  Deploy
skipped remove_coverage #210909
allowed to fail manual
skipped remove_docs #210911
allowed to fail manual
skipped upload documentation to the test server #210910
canceled remove_coverage #210872
allowed to fail manual

canceled remove_docs #210874
allowed to fail manual

canceled upload documentation to the test server #210873

 
Name Stage Failure
failed
check for broken links in doc Test
Running Sphinx v4.1.0

Extension error:
Could not import extension sphinxcontrib.rsvgconverter (exception: No module named 'sphinxcontrib.rsvgconverter')
Makefile:39: recipe for target 'linkcheck' failed
make: Leaving directory '/builds/kwant/kwant/doc'
make: *** [linkcheck] Error 2
Authenticating with credentials from /root/.docker/config.json
ERROR: Job failed: exit code 1
failed
build PDF documentation Test
Running Sphinx v4.1.0

Extension error:
Could not import extension sphinxcontrib.rsvgconverter (exception: No module named 'sphinxcontrib.rsvgconverter')
Makefile:33: recipe for target 'latex' failed
make: Leaving directory '/builds/kwant/kwant/doc'
make: *** [latex] Error 2
Authenticating with credentials from /root/.docker/config.json
ERROR: Job failed: exit code 1
failed
build documentation Test
Running Sphinx v4.1.0

Extension error:
Could not import extension sphinxcontrib.rsvgconverter (exception: No module named 'sphinxcontrib.rsvgconverter')
make: *** [html] Error 2
Makefile:39: recipe for target 'html' failed
make: Leaving directory '/builds/kwant/kwant/doc'
Authenticating with credentials from /root/.docker/config.json
ERROR: Job failed: exit code 1
failed
test:latest Test
2.18s call     kwant/tests/test_plotter.py::test_spectrum[matplotlib]
2.07s call kwant/tests/test_plotter.py::test_matplotlib_plot
1.96s call kwant/physics/tests/test_gauge.py::test_minimal_cycle_basis[2-honeycomb-half-ring]
============ 2 failed, 578 passed, 12 warnings in 103.01s (0:01:43) ============
Authenticating with credentials from /root/.docker/config.json
Uploading artifacts...
tests.xml: found 1 matching files

Uploading artifacts to coordinator... ok
id=210905 responseStatus=201 Created token=5szuzsMi
ERROR: Job failed: exit code 1