refill code in system.py

19 jobs for master in 11 minutes and 11 seconds (queued for 3 seconds)
Status Job ID Name Coverage
  Build Env
manual #146974
allowed to fail manual
build-env:conda
manual #146973
allowed to fail manual
build-env:debian
manual #146975
allowed to fail manual
build-env:default
manual #146972
allowed to fail manual
build-env:ubuntu
 
  Build
passed #146977
build:debian

00:02:49

passed #146980
build:latest

00:02:45

passed #146979
build:no-extras

00:02:27

passed #146978
build:stable

00:02:30

passed #146976
build:ubuntu

00:03:04

 
  Test
failed #146989
build PDF documentation

00:02:31

failed #146988
build documentation

00:03:09

failed #146990
allowed to fail
check for broken links in doc

00:08:05

passed #146982
check for dependencies installed

00:01:06

passed #146981
check whitespace style

00:00:29

failed #146986
test:debian

00:02:16

failed #146987
test:latest

00:02:05

failed #146984
test:no-extras

00:01:22

failed #146983
test:stable

00:01:55

failed #146985
test:ubuntu

00:01:43

 
Name Stage Failure
failed
check for broken links in doc Test

build finished with problems, 32 warnings.
Makefile:39: recipe for target 'linkcheck' failed
make: Leaving directory '/builds/pablopiskunow/kwant/doc'
make: *** [linkcheck] Error 1
Running after_script
Uploading artifacts for failed job
Authenticating with credentials from /root/.docker/config.json
ERROR: Job failed: exit code 1
failed
build documentation Test
Warning, treated as error:
`jupyter-sphinx` was initialized with the `jupyter_sphinx.execute` sub-module. Replace this with `jupyter_sphinx`. Initializing with `jupyter_sphinx.execute` will be removed in version 0.3
make: *** [html] Error 2
Makefile:39: recipe for target 'html' failed
make: Leaving directory '/builds/pablopiskunow/kwant/doc'
Running after_script
Uploading artifacts for failed job
Authenticating with credentials from /root/.docker/config.json
ERROR: Job failed: exit code 1
failed
build PDF documentation Test
Running Sphinx v3.2.1

Warning, treated as error:
`jupyter-sphinx` was initialized with the `jupyter_sphinx.execute` sub-module. Replace this with `jupyter_sphinx`. Initializing with `jupyter_sphinx.execute` will be removed in version 0.3
Makefile:33: recipe for target 'latex' failed
make: Leaving directory '/builds/pablopiskunow/kwant/doc'
make: *** [latex] Error 2
Authenticating with credentials from /root/.docker/config.json
ERROR: Job failed: exit code 1
failed
test:debian Test
1.31s call     kwant/tests/test_plotter.py::test_spectrum[matplotlib]
============ 1 failed, 542 passed, 16 warnings in 65.59s (0:01:05) =============
Running after_script
Uploading artifacts for failed job
Authenticating with credentials from /root/.docker/config.json
Uploading artifacts...
tests.xml: found 1 matching files

Uploading artifacts to coordinator... ok
id=146986 responseStatus=201 Created token=V1_dxPud
ERROR: Job failed: exit code 1
failed
test:latest Test
2.34s call     kwant/tests/test_qsymm.py::test_inverse_transform
2.03s call kwant/tests/test_plotter.py::test_current_interpolation
1.79s call kwant/tests/test_plotter.py::test_spectrum[matplotlib]
=========== 1 failed, 542 passed, 6038 warnings in 98.55s (0:01:38) ============
Authenticating with credentials from /root/.docker/config.json
Uploading artifacts...
tests.xml: found 1 matching files

Uploading artifacts to coordinator... ok
id=146987 responseStatus=201 Created token=J-XjR38s
ERROR: Job failed: exit code 1
failed
test:stable Test
1.87s call     kwant/physics/tests/test_leads.py::test_modes_symmetries
1.85s call kwant/tests/test_qsymm.py::test_inverse_transform
1.80s call kwant/tests/test_plotter.py::test_current_interpolation
============ 1 failed, 542 passed, 14 warnings in 94.52s (0:01:34) =============
Authenticating with credentials from /root/.docker/config.json
Uploading artifacts...
tests.xml: found 1 matching files

Uploading artifacts to coordinator... ok
id=146983 responseStatus=201 Created token=w7UkNDzx
ERROR: Job failed: exit code 1
failed
test:ubuntu Test
1.88s call     kwant/tests/test_plotter.py::test_spectrum[matplotlib]
1.83s call kwant/tests/test_plotter.py::test_matplotlib_plot
1.82s call kwant/tests/test_rmt.py::test_gaussian_distributions
=========== 1 failed, 542 passed, 1354 warnings in 81.44s (0:01:21) ============
Authenticating with credentials from /root/.docker/config.json
Uploading artifacts...
tests.xml: found 1 matching files

Uploading artifacts to coordinator... ok
id=146985 responseStatus=201 Created token=_hihCgZb
ERROR: Job failed: exit code 1
failed
test:no-extras Test
/usr/local/envs/kwant-stable-no-extras/lib/python3.7/site-packages/pep8.py:110: FutureWarning: Possible nested set at position 1
EXTRANEOUS_WHITESPACE_REGEX = re.compile(r'[[({] | []}),;:]')
Running after_script
Uploading artifacts for failed job
Authenticating with credentials from /root/.docker/config.json
Uploading artifacts...
tests.xml: found 1 matching files

Uploading artifacts to coordinator... ok
id=146984 responseStatus=201 Created token=Fwjvy4kc
ERROR: Job failed: exit code 1