Merge branch 'fix/kaniko_pin_version' into 'master'

Pin Kaniko version to v0.16.0

See merge request !357
27 jobs for master in 44 minutes and 7 seconds (queued for 3 seconds)
Status Job ID Name Coverage
  Build Env
manual #108741
allowed to fail manual
build-env:conda
manual #108740
allowed to fail manual
build-env:debian
manual #108742
allowed to fail manual
build-env:default
manual #108739
allowed to fail manual
build-env:ubuntu
 
  Build
passed #108748
build:bleeding-edge

00:05:31

passed #108744
build:debian

00:04:00

passed #108747
build:latest

00:02:43

passed #108746
build:no-extras

00:04:13

passed #108745
build:stable

00:04:22

passed #108743
build:ubuntu

00:03:53

 
  Test
failed #108759
build PDF documentation

00:07:17

failed #108758
build documentation

00:06:44

failed #108760
allowed to fail
check for broken links in doc

00:07:42

passed #108750
check for dependencies installed

00:00:33

passed #108749
check whitespace style

00:00:35

passed #108757
coverage:latest

00:38:34

passed #108756
test:bleeding-edge

00:04:35

passed #108754
test:debian

00:01:47

passed #108755
test:latest

00:03:31

passed #108752
test:no-extras

00:01:10

passed #108751
test:stable

00:02:32

passed #108753
test:ubuntu

00:02:01

 
  Deploy
skipped #108762
allowed to fail manual
remove_coverage
skipped #108764
allowed to fail manual
remove_docs
skipped #108761
upload coverage
skipped #108765
upload dev version docs
skipped #108763
upload documentation to the test server
 
Name Stage Failure
failed
check for broken links in doc Test
writing output... [100%] tutorial/superconductors


build finished with problems, 2 warnings.
Makefile:39: recipe for target 'linkcheck' failed
make: Leaving directory '/builds/kwant/kwant/doc'
make: *** [linkcheck] Error 1
Authenticating with credentials from /root/.docker/config.json
ERROR: Job failed: exit code 1
failed
build PDF documentation Test

The makeMappingArray function was deprecated in Matplotlib 3.2 and will be removed two minor releases later. This is not considered public API any longer.


make: *** [latex] Error 2
Makefile:33: recipe for target 'latex' failed
make: Leaving directory '/builds/kwant/kwant/doc'
Authenticating with credentials from /root/.docker/config.json
ERROR: Job failed: exit code 1
failed
build documentation Test

The makeMappingArray function was deprecated in Matplotlib 3.2 and will be removed two minor releases later. This is not considered public API any longer.


make: *** [html] Error 2
Makefile:39: recipe for target 'html' failed
make: Leaving directory '/builds/kwant/kwant/doc'
Authenticating with credentials from /root/.docker/config.json
ERROR: Job failed: exit code 1